{"text_format":"1","workbook":"xlsx","n_sheets":8,"sheets":["Step 1 - Fungicide Planner","Step 2 - Order Planner","Step 2 - OldManage Apps","Step 3 - Review Order","Range Reference","Article Reference","Coverage Reference","Sheet1"],"not_rendered":{"charts":0,"images":6,"macros":1,"external_links":0,"defined_names":7,"comments":0,"pivot_tables":0},"unopened":[],"bounds":{"document_bytes":16777216,"sheet_cells":100000,"rows_first":2000,"rows_last":500,"rows_between":2000,"halvings":0,"cell_chars":16384,"cell_head_chars":4096},"cells_cut":0,"cells_raw":0,"read":"whole","date_system":"1900"}

{"sheet":"Step 1 - Fungicide Planner","index":0,"n_rows":37,"n_cols":15,"rows_kept":37,"cut":false,"hidden":false,"merged":[[28,0,29,0],[17,2,18,2],[16,0,16,9],[17,9,18,9],[36,0,45,9],[17,8,18,8],[32,0,33,0],[17,6,18,6],[17,7,18,7],[30,0,31,0],[17,0,18,0],[17,1,18,1],[17,4,18,4],[17,5,18,5],[23,0,24,0],[25,0,26,0],[17,3,18,3],[35,0,35,9]]}
[]
[]
[]
[]
[]
[]
[]
[]
[]
[]
[]
[]
[]
[]
[]
[]
["Design Your Own Program Fungicide Planner"]
["BASF Brand Name","Case Size","Article No.","Use Area","Acres","Application Rate","Number of Applications","Cases of Product Needed","Cost per Acre\n(before rebate)","Cost per Acre\n(after rebate*)"]
[null,null,null,null,null,null,null,null,null,null,"Article","Rate","Coverage","Cases"]
["Aramax™ Intrinsic®",{"$f":"VLOOKUP(C20,'Article Reference'!$A$3:$C$17,3,FALSE)","v":"2 x 2.5 gal"},59026671,null,0,"43.5 oz",0,{"$f":"IF(M20=0,0,(G20*E20)/M20)","v":0},{"$f":"IF(G20*E20=0,0,(ROUND(H20,2)*VLOOKUP(K20,'Step 2 - Order Planner'!$C$26:$D$72,2,FALSE))/(G20*E20))","v":0},{"$f":"IF(G20*E20=0,0,((VLOOKUP(K20,'Step 2 - Order Planner'!$C$26:$D$72,2,FALSE)*(1-'Step 2 - Order Planner'!$B$20))*ROUND(H20,2))/(G20*E20))","v":0},59026671,7,{"$f":"IF(L20=0,0,VLOOKUP(K20,'Coverage Reference'!$B$4:$H$21,L20,FALSE))","v":14.712643678160919},{"$f":"H20","v":0}]
{"$rows_left_out":18}
{"sheet":"Step 2 - Order Planner","index":1,"n_rows":79,"n_cols":17,"rows_kept":79,"cut":false,"hidden":false,"merged":[[28,15,29,15],[78,0,87,8],[19,1,19,2],[17,0,18,0],[17,1,18,2],[68,0,68,3],[68,5,68,6],[22,3,22,6],[22,7,22,8],[21,3,21,6],[21,7,21,8],[73,9,73,11],[40,9,40,11],[40,0,40,4],[73,0,73,4],[41,4,71,4],[42,0,42,3],[47,0,47,3],[51,0,51,3],[61,0,61,3],[42,5,42,6],[47,5,47,6],[51,5,51,6],[61,5,61,6],[41,7,73,8],[7,0,7,8],[8,0,8,8],[15,0,15,8],[19,7,19,8],[16,1,16,2],[17,7,17,8],[16,7,16,8],[20,7,20,8],[18,3,18,6],[17,3,17,6],[20,1,20,2],[16,3,16,6],[20,3,20,6],[18,7,18,8],[19,3,19,6],[30,15,31,15],[30,16,31,16],[32,15,33,15],[32,16,33,16],[6,0,6,8],[14,15,14,16],[15,15,16,16],[17,16,18,16],[17,15,18,15],[19,15,20,15],[19,16,20,16],[25,15,27,15],[25,16,27,16],[28,16,29,16],[21,16,22,16],[21,15,22,15]]}
[]
[]
[]
[]
[]
[]
[]
[]
[]
[]
[]
[]
[]
[]
[null,null,null,null,null,null,null,null,null,null,null,null,null,null,null,"Upgrade Your DYOP Rebate"]
["EOP Rebate Calculator",null,null,null,null,null,null,null,null,null,null,null,null,null,null,{"$f":"IF('Range Reference'!S18=0,\"Buy 3 fungicide brands to qualify\",IF('Range Reference'!S18=1,\"Buy 2 more fungicide brands to qualify\",IF('Range Reference'!S18=2,\"Buy 1 more fungicide brand to qualify\",\"Qualified\")))","v":"Buy 3 fungicide brands to qualify"}]
["DYOP Rebate Program Locked",{"$f":"IF(AND(G41>=3000,'Range Reference'!Q18>=1),\"October Rebate Locked\",IF(AND(J41>=3000,'Range Reference'!S18>=1),\"Nov-Dec Rebate Locked\",\"Rebate Level Not Achieved\"))","v":"Rebate Level Not Achieved"},null,"DYOP Total Purchases",null,null,null,{"$f":"'Article Reference'!G18","v":0}]
["3 or More Fungicide Brands",{"$f":"IF(AND(H17>=3000,'Range Reference'!S18>=3),\"Design Your Own Program Rebate\",\"Need to buy \"&3-'Range Reference'!S18&\" More Brand(s)\")","v":"Need to buy 3 More Brand(s)"},null,"DYOP Rebate",null,null,null,{"$f":"IF(AND(B20=0,B21>0),H17*B21,(B20*H17))","v":0},null,null,null,null,null,null,null,"Spend for Next DYOP Level","Next Level"]
[null,null,null,"Across-the-Course-Solutions Purchases",null,null,null,{"$f":"'Article Reference'!G54","v":0}]
["DYOP Rebate",{"$f":"IF(AND('Range Reference'!S18<3,G41>=3000),0.08,IF(AND('Range Reference'!S18<3,I41>=3000),0.03,'Range Reference'!G16))","v":0},null,"Across-the-Course-Solutions Rebate",null,null,null,{"$f":"(H19*B21)","v":0},null,null,null,null,null,null,null,{"$f":"IF(P16<>\"Qualified\",\"\",HLOOKUP(H17,'Range Reference'!$H$10:$H$16,7,FALSE))","v":""},{"$f":"IF(ISNA(IF(P20=0,\"Max\",VLOOKUP(P20,'Range Reference'!H11:I15,2,FALSE)))=TRUE,\"\",IF(P20=0,\"Max\",VLOOKUP(P20,'Range Reference'!H11:I15,2,FALSE)))","v":""}]
{"$rows_left_out":60}
{"sheet":"Step 2 - OldManage Apps","index":2,"n_rows":40,"n_cols":13,"rows_kept":40,"cut":false,"hidden":true,"merged":[[16,0,16,1],[15,0,15,1],[20,7,20,8],[20,5,20,6],[20,3,20,4],[19,0,19,8],[39,0,46,8],[22,0,23,0],[20,2,21,2],[24,0,25,0],[20,0,21,0],[20,1,21,1],[35,0,36,0],[33,0,34,0],[31,0,32,0],[29,0,30,0],[26,0,27,0]]}
[]
[]
[]
[]
[]
[]
[]
[]
[]
[]
[]
[]
[]
[]
["Enter Acres for your Course (Required)"]
["Fairways & Tees Acres",null,40]
["Greens Acres",null,10]
[]
["Please complete Yellow \"Use Area\" cells with either Fairways or Greens"]
["Fungicide Planner",null,null,null,null,null,null,null,null,null,null,null,"Fairways"]
{"$rows_left_out":21}
{"sheet":"Step 3 - Review Order","index":3,"n_rows":69,"n_cols":6,"rows_kept":69,"cut":false,"hidden":false,"merged":[[10,0,11,5],[68,0,77,5],[40,0,40,4],[66,0,66,4],[13,3,13,4],[14,3,14,4],[15,3,15,4],[16,3,16,4],[17,3,17,4],[20,3,21,4],[20,5,21,5],[18,3,18,4],[19,3,19,4]]}
[]
[]
[]
[]
[]
[]
[]
[]
[]
[]
["BASF 2026 EOP ORDER SUMMARY"]
[]
[{"$f":"NOW()","v":"2025-07-15T11:22:01"},null,null,"Rebate Summary"]
["Order For","Order Prepared By",null,"Total Purchase",null,{"$f":"'Step 2 - Order Planner'!H21","v":0}]
["<Enter Customer Name>","<Enter Name>",null,"DYOP Rebate Attained",null,{"$f":"'Step 2 - Order Planner'!B20","v":0}]
["<Enter Business Name>","<Enter Business Name>",null,"Across-The-Course Rebate",null,{"$f":"'Step 2 - Order Planner'!B21","v":0}]
["<City, ST Zip Code>","<City, ST Zip Code>",null,{"$f":"'Step 2 - Order Planner'!A22","v":"Aramax™ SC Intrinsic® Kicker Rebate"},null,{"$f":"'Step 2 - Order Planner'!B22","v":0}]
["<Phone>","<Phone>",null,"Aramax™ SC Intrinsic® % Attained",null,{"$f":"'Step 2 - Order Planner'!C22","v":0}]
["<email address>","<email address>",null,"Tower® Herbicide Fairway Kicker Rebate",null,{"$f":"'Step 2 - Order Planner'!B23","v":0}]
[null,null,null,"Tower® Herbicide Fairway Kicker % Attained",null,{"$f":"'Step 2 - Order Planner'!C23","v":0}]
{"$rows_left_out":50}
{"sheet":"Range Reference","index":4,"n_rows":23,"n_cols":19,"rows_kept":23,"cut":false,"hidden":true,"merged":[[14,16,16,16],[1,16,2,16],[1,17,2,17],[1,18,2,18],[22,2,22,3],[5,18,6,18],[5,17,6,17],[5,16,6,16],[7,18,8,18],[7,17,8,17],[7,16,8,16],[14,18,16,18],[10,18,11,18],[10,17,11,17],[10,16,11,16],[12,18,13,18],[12,17,13,17],[12,16,13,16],[14,17,16,17]]}
["Standard",null,"Oct","Nov-Dec",null,null,null,null,null,null,null,"Article#","Article","Package","Oct Order","Nov-Dec Order","Oct Count","Nov-Dec Count","Total"]
["Low","High","Discount","Discount","Oct Applied",null,"Rebate Applied",null,null,null,null,59026671,{"$f":"VLOOKUP($L2,'Article Reference'!$A$3:$C$17,2,FALSE)","v":"Aramax™ Intrinsic® brand Fungicide"},{"$f":"VLOOKUP($L2,'Article Reference'!$A$3:$C$17,3,FALSE)","v":"2 x 2.5 gal"},{"$f":"VLOOKUP(L2,'Step 2 - Order Planner'!$C$26:$F$40,4,FALSE)","v":0},{"$f":"VLOOKUP(L2,'Step 2 - Order Planner'!$C$26:$H$40,6,FALSE)","v":0},{"$f":"IF(O2+O3>0,1,0)","v":0},{"$f":"IF(P2+P3>0,1,0)","v":0},{"$f":"IF(OR(Q2=1,R2=1),1,0)","v":0}]
[3000,{"$f":"A4-1","v":7999},0.04,0.04,{"$f":"IF(AND(('Step 2 - Order Planner'!$H$19+$E$7)>=3000,'Step 2 - Order Planner'!$H$19+$E$7>=$A3,'Step 2 - Order Planner'!$H$19+$E$7<=$B3),C3)","v":false},null,{"$f":"SUM(E3:F3)","v":0},null,null,null,null,59032979,{"$f":"VLOOKUP($L3,'Article Reference'!$A$3:$C$17,2,FALSE)","v":"Aramax™ Intrinsic brand fungicide"},{"$f":"VLOOKUP($L3,'Article Reference'!$A$3:$C$17,3,FALSE)","v":"4 x 43.5 fl oz"}]
[8000,{"$f":"A5-1","v":19999},0.06,0.06,{"$f":"IF(AND(('Step 2 - Order Planner'!$H$19+$E$7)>=3000,'Step 2 - Order Planner'!$H$19+$E$7>=$A4,'Step 2 - Order Planner'!$H$19+$E$7<=$B4),C4)","v":false},null,{"$f":"SUM(E4:F4)","v":0},null,null,null,null,59021463,{"$f":"VLOOKUP($L4,'Article Reference'!$A$5:$C$17,2,FALSE)","v":"Emerald® fungicide"},{"$f":"VLOOKUP($L4,'Article Reference'!$A$5:$C$17,3,FALSE)","v":"10 x 0.49 lb"},{"$f":"VLOOKUP(L4,'Step 2 - Order Planner'!$C$26:$F$40,4,FALSE)","v":0},{"$f":"VLOOKUP(L4,'Step 2 - Order Planner'!$C$26:$H$40,6,FALSE)","v":0},{"$f":"IF(O4>0,1,0)","v":0},0,{"$f":"IF(OR(Q4=1,R4=1),1,0)","v":0}]
[20000,1000000,0.12,0.12,{"$f":"IF(AND(('Step 2 - Order Planner'!$H$19+$E$7)>=3000,'Step 2 - Order Planner'!$H$19+$E$7>=$A5,'Step 2 - Order Planner'!$H$19+$E$7<=$B5),C5)","v":false},null,{"$f":"SUM(E5:F5)","v":0},null,null,null,null,59014003,{"$f":"VLOOKUP($L5,'Article Reference'!$A$5:$C$17,2,FALSE)","v":"Encartis® fungicide"},{"$f":"VLOOKUP($L5,'Article Reference'!$A$5:$C$17,3,FALSE)","v":"2 x 2.5 gal"},{"$f":"VLOOKUP(L5,'Step 2 - Order Planner'!$C$26:$F$40,4,FALSE)","v":0},{"$f":"VLOOKUP(L5,'Step 2 - Order Planner'!$C$26:$H$40,6,FALSE)","v":0},0,0,{"$f":"IF(OR(Q5=1,R5=1),1,0)","v":0}]
[null,null,"DISCOUNT",null,{"$f":"SUM(E3:E5)","v":0},null,{"$f":"SUM(E6:F6)","v":0},null,null,null,null,59012350,{"$f":"VLOOKUP($L6,'Article Reference'!$A$5:$C$17,2,FALSE)","v":"Honor® Intrinsic® brand fungicide"},{"$f":"VLOOKUP($L6,'Article Reference'!$A$5:$C$17,3,FALSE)","v":"6 x 3 lb"},{"$f":"VLOOKUP(L6,'Step 2 - Order Planner'!$C$26:$F$40,4,FALSE)","v":0},{"$f":"VLOOKUP(L6,'Step 2 - Order Planner'!$C$26:$H$40,6,FALSE)","v":0},{"$f":"IF(O6+O7>0,1,0)","v":0},{"$f":"IF(P6+P7>0,1,0)","v":0},{"$f":"IF(OR(Q6=1,R6=1),1,0)","v":0}]
[null,null,null,null,0,null,null,null,null,null,null,59012885,{"$f":"VLOOKUP($L7,'Article Reference'!$A$5:$C$17,2,FALSE)","v":"Honor® Intrinsic® brand fungicide"},{"$f":"VLOOKUP($L7,'Article Reference'!$A$5:$C$17,3,FALSE)","v":"1 x 36 lb"},{"$f":"VLOOKUP(L7,'Step 2 - Order Planner'!$C$26:$F$40,4,FALSE)","v":0},{"$f":"VLOOKUP(L7,'Step 2 - Order Planner'!$C$26:$H$40,6,FALSE)","v":0}]
[null,null,null,null,null,null,null,null,null,null,null,59028038,{"$f":"VLOOKUP($L8,'Article Reference'!$A$5:$C$17,2,FALSE)","v":"Insignia® SC Intrinsic® brand fungicide"},{"$f":"VLOOKUP($L8,'Article Reference'!$A$5:$C$17,3,FALSE)","v":"4 x 30.5 fl oz"},{"$f":"VLOOKUP(L8,'Step 2 - Order Planner'!$C$26:$F$40,4,FALSE)","v":0},{"$f":"VLOOKUP(L8,'Step 2 - Order Planner'!$C$26:$H$40,6,FALSE)","v":0},{"$f":"IF(O8+O9>0,1,0)","v":0},{"$f":"IF(P8+P9>0,1,0)","v":0},{"$f":"IF(OR(Q8=1,R8=1),1,0)","v":0}]
["DYOP",null,"Oct","Nov-Dec",null,null,null,null,null,null,null,59028040,{"$f":"VLOOKUP($L9,'Article Reference'!$A$5:$C$17,2,FALSE)","v":"Insignia® SC Intrinsic® brand fungicide"},{"$f":"VLOOKUP($L9,'Article Reference'!$A$5:$C$17,3,FALSE)","v":"2 x 2.5 gal"},{"$f":"VLOOKUP(L9,'Step 2 - Order Planner'!$C$26:$F$40,4,FALSE)","v":0},{"$f":"VLOOKUP(L9,'Step 2 - Order Planner'!$C$26:$H$40,6,FALSE)","v":0}]
["Low","High","Discount","Discount","Oct Applied","Nov-Dec Applied","Rebate Applied",{"$f":"'Step 2 - Order Planner'!H17:I17","v":0},null,null,null,59027998,{"$f":"VLOOKUP($L10,'Article Reference'!$A$5:$C$17,2,FALSE)","v":"Lexicon® Intrinsic® brand fungicide"},{"$f":"VLOOKUP($L10,'Article Reference'!$A$5:$C$17,3,FALSE)","v":"4 x 21 oz"},{"$f":"VLOOKUP(L10,'Step 2 - Order Planner'!$C$26:$F$40,4,FALSE)","v":0},{"$f":"VLOOKUP(L10,'Step 2 - Order Planner'!$C$26:$H$40,6,FALSE)","v":0},{"$f":"IF(O10>0,1,0)","v":0},{"$f":"IF(P10>0,1,0)","v":0},{"$f":"IF(OR(Q10=1,R10=1),1,0)","v":0}]
[3000,{"$f":"A12-1","v":7999},0.08,0.03,{"$f":"IF(AND(('Step 2 - Order Planner'!$G$41)>=3000,Q18>=1),C11)","v":false},{"$f":"IF(AND(('Step 2 - Order Planner'!$J$41)>=3000,S18>=1),D11)","v":false},{"$f":"IF(E11<>FALSE,E11,F11)","v":false},{"$f":"A11-H10","v":3000},0.08,null,null,59018087,{"$f":"VLOOKUP($L11,'Article Reference'!$A$5:$C$17,2,FALSE)","v":"Maxtima® fungicide"},{"$f":"VLOOKUP($L11,'Article Reference'!$A$5:$C$17,3,FALSE)","v":"4 x 26 oz"},{"$f":"VLOOKUP(L11,'Step 2 - Order Planner'!$C$26:$F$40,4,FALSE)","v":0},{"$f":"VLOOKUP(L11,'Step 2 - Order Planner'!$C$26:$H$40,6,FALSE)","v":0},{"$f":"IF(O11+O12>0,1,0)","v":0},{"$f":"IF(P11+P12>0,1,0)","v":0},{"$f":"IF(OR(Q11=1,R11=1),1,0)","v":0}]
[8000,{"$f":"A13-1","v":19999},0.14000000000000001,0.06,{"$f":"IF(AND(('Step 2 - Order Planner'!$G$41)>=3000,$Q$18>=1,'Step 2 - Order Planner'!J41>=$A12,'Step 2 - Order Planner'!J41<=$B12),C12)","v":false},{"$f":"IF(AND(('Step 2 - Order Planner'!$J$41)>=3000,$S$18>=1,'Step 2 - Order Planner'!J41>=$A12,'Step 2 - Order Planner'!J41<=$B12),D12)","v":false},{"$f":"IF(E12<>FALSE,E12,F12)","v":false},{"$f":"A12-H10","v":8000},0.14000000000000001,null,null,59018071,{"$f":"VLOOKUP($L12,'Article Reference'!$A$5:$C$17,2,FALSE)","v":"Maxtima® fungicide"},{"$f":"VLOOKUP($L12,'Article Reference'!$A$5:$C$17,3,FALSE)","v":"2 x 2.5 gal"},{"$f":"VLOOKUP(L12,'Step 2 - Order Planner'!$C$26:$F$40,4,FALSE)","v":0},{"$f":"VLOOKUP(L12,'Step 2 - Order Planner'!$C$26:$H$40,6,FALSE)","v":0}]
[20000,{"$f":"A14-1","v":29999},0.17,0.09,{"$f":"IF(AND(('Step 2 - Order Planner'!$G$41)>=3000,Q18>=1,'Step 2 - Order Planner'!J41>=$A13,'Step 2 - Order Planner'!J41<=$B13),C13)","v":false},{"$f":"IF(AND(('Step 2 - Order Planner'!$J$41)>=3000,$S$18>=1,'Step 2 - Order Planner'!J41>=$A13,'Step 2 - Order Planner'!J41<=$B13),D13)","v":false},{"$f":"IF(E13<>FALSE,E13,F13)","v":false},{"$f":"A13-H10","v":20000},0.17,null,null,59018094,{"$f":"VLOOKUP($L13,'Article Reference'!$A$5:$C$17,2,FALSE)","v":"Navicon® Intrinsic® brand fungicide"},{"$f":"VLOOKUP($L13,'Article Reference'!$A$5:$C$17,3,FALSE)","v":"4 x 37 fl oz"},{"$f":"VLOOKUP(L13,'Step 2 - Order Planner'!$C$26:$F$40,4,FALSE)","v":0},{"$f":"VLOOKUP(L13,'Step 2 - Order Planner'!$C$26:$H$40,6,FALSE)","v":0},{"$f":"IF(O13+O14>0,1,0)","v":0},{"$f":"IF(P13+P14>0,1,0)","v":0},{"$f":"IF(OR(Q13=1,R13=1),1,0)","v":0}]
[30000,{"$f":"A15-1","v":39999},0.2,0.1,{"$f":"IF(AND(('Step 2 - Order Planner'!$G$41)>=3000,Q18>=1,'Step 2 - Order Planner'!J41>=$A14,'Step 2 - Order Planner'!J41<=$B14),C14)","v":false},{"$f":"IF(AND(('Step 2 - Order Planner'!$J$41)>=3000,$S$18>=1,'Step 2 - Order Planner'!J41>=$A14,'Step 2 - Order Planner'!J41<=$B14),D14)","v":false},{"$f":"IF(E14<>FALSE,E14,F14)","v":false},{"$f":"A14-H10","v":30000},0.2,null,null,59018095,{"$f":"VLOOKUP($L14,'Article Reference'!$A$5:$C$17,2,FALSE)","v":"Navicon® Intrinsic® brand fungicide"},{"$f":"VLOOKUP($L14,'Article Reference'!$A$5:$C$17,3,FALSE)","v":"2 x 2.5 gal"},{"$f":"VLOOKUP(L14,'Step 2 - Order Planner'!$C$26:$F$40,4,FALSE)","v":0},{"$f":"VLOOKUP(L14,'Step 2 - Order Planner'!$C$26:$H$40,6,FALSE)","v":0}]
[40000,10000000,0.24,0.12,{"$f":"IF(AND(('Step 2 - Order Planner'!$G$41)>=3000,Q18>=1,'Step 2 - Order Planner'!J41>=$A15,'Step 2 - Order Planner'!J41<=$B15),C15)","v":false},{"$f":"IF(AND(('Step 2 - Order Planner'!$J$41)>=3000,$S$18>=1,'Step 2 - Order Planner'!J41>=$A15,'Step 2 - Order Planner'!J41<=$B15),D15)","v":false},{"$f":"IF(E15<>FALSE,E15,F15)","v":false},{"$f":"A15-H10","v":40000},0.24,null,null,59013833,{"$f":"VLOOKUP($L15,'Article Reference'!$A$5:$C$17,2,FALSE)","v":"Xzemplar® fungicide"},{"$f":"VLOOKUP($L15,'Article Reference'!$A$5:$C$17,3,FALSE)","v":"2 x 114 oz"},{"$f":"VLOOKUP(L15,'Step 2 - Order Planner'!$C$26:$F$40,4,FALSE)","v":0},{"$f":"VLOOKUP(L15,'Step 2 - Order Planner'!$C$26:$H$40,6,FALSE)","v":0},{"$f":"IF(O15+O17>0,1,0)","v":0},{"$f":"IF(P15+P17>0,1,0)","v":0},{"$f":"IF(OR(Q15=1,R15=1),1,0)","v":0}]
[null,null,"DISCOUNT",null,null,null,{"$f":"MAX(G11:G15)","v":0},{"$f":"MIN(IF(H11:H15>0,H11:H15))","v":3000}]
[null,null,null,null,null,null,null,null,null,null,null,59014120,{"$f":"VLOOKUP($L17,'Article Reference'!$A$5:$C$17,2,FALSE)","v":"Xzemplar® fungicide"},{"$f":"VLOOKUP($L17,'Article Reference'!$A$5:$C$17,3,FALSE)","v":"4 x 11.4 oz"},{"$f":"VLOOKUP(L17,'Step 2 - Order Planner'!$C$26:$F$40,4,FALSE)","v":0},{"$f":"VLOOKUP(L17,'Step 2 - Order Planner'!$C$26:$H$40,6,FALSE)","v":0}]
["Table B for Fungicides",null,null,null,null,null,null,null,null,null,null,null,null,null,null,null,{"$f":"SUM(Q2:Q17)","v":0},{"$f":"SUM(R2:R17)","v":0},{"$f":"SUM(S2:S17)","v":0}]
["Low","High","Discount","Discount",null,null,"Rebate Applied",{"$f":"'Step 2 - Order Planner'!H19:I19","v":0}]
[3000,{"$f":"A21-1","v":7999},0.04,0.04,{"$f":"IF(AND(('Step 2 - Order Planner'!$G$41+'Step 2 - Order Planner'!$I$41+'Step 2 - Order Planner'!$G$74)>=3000,'Step 2 - Order Planner'!$G$41+'Step 2 - Order Planner'!$I$41+'Step 2 - Order Planner'!$G$74>=$A20,'Step 2 - Order Planner'!$G$41+'Step 2 - Order Planner'!$I$41+'Step 2 - Order Planner'!$G$74<=$B20,S18<=3),C20)","v":false},{"$f":"IF(AND(SUM('Step 2 - Order Planner'!G26:G39)>=3000,SUM('Step 2 - Order Planner'!G26:G39)<8000),0.04,0)","v":0},{"$f":"SUM(E20:F20)","v":0},{"$f":"A20-$H$19","v":3000},0.04]
{"$rows_left_out":4}
{"sheet":"Article Reference","index":5,"n_rows":54,"n_cols":14,"rows_kept":54,"cut":false,"hidden":true,"merged":[[0,0,0,4],[18,0,18,4]]}
["2026 Qualifying Fungicides"]
["Article Number","Qaulifying Non-Agency Products","Package","Price","CA Redemption","Volume","Rebae Sales Total","Case UOM","Price/UOM","Case Price"]
[59026671,"Aramax™ Intrinsic® brand Fungicide","2 x 2.5 gal",5215,5359.7,{"$f":"VLOOKUP($A3,'Step 2 - Order Planner'!$C$26:$H$40,4,FALSE)+VLOOKUP($A3,'Step 2 - Order Planner'!$C$26:$H$40,6,FALSE)","v":0},{"$f":"F3*D3","v":0},5,{"$f":"J3/H3","v":1043},{"$f":"D3","v":5215}]
[59032979,"Aramax™ Intrinsic brand fungicide","4 x 43.5 fl oz",1479,1520.76,{"$f":"VLOOKUP($A4,'Step 2 - Order Planner'!$C$26:$H$40,4,FALSE)+VLOOKUP($A4,'Step 2 - Order Planner'!$C$26:$H$40,6,FALSE)","v":0},{"$f":"F4*D4","v":0},{"$f":"4*43.5","v":174},{"$f":"J4/H4","v":8.5},{"$f":"D4","v":1479}]
[59021463,"Emerald® fungicide","10 x 0.49 lb",1239.7,1274.0999999999999,{"$f":"VLOOKUP($A5,'Step 2 - Order Planner'!$C$26:$H$40,4,FALSE)+VLOOKUP($A5,'Step 2 - Order Planner'!$C$26:$H$40,6,FALSE)","v":0},0,{"$f":"10*0.49","v":4.9000000000000004},{"$f":"J5/H5","v":253},{"$f":"D5","v":1239.7}]
[59014003,"Encartis® fungicide","2 x 2.5 gal",680,698.86,{"$f":"VLOOKUP($A6,'Step 2 - Order Planner'!$C$26:$H$40,4,FALSE)+VLOOKUP($A6,'Step 2 - Order Planner'!$C$26:$H$40,6,FALSE)","v":0},0,{"$f":"2*2.5","v":5},{"$f":"J6/H6","v":136},{"$f":"D6","v":680}]
[59012350,"Honor® Intrinsic® brand fungicide","6 x 3 lb",3528,3625.92,{"$f":"VLOOKUP($A7,'Step 2 - Order Planner'!$C$26:$H$40,4,FALSE)+VLOOKUP($A7,'Step 2 - Order Planner'!$C$26:$H$40,6,FALSE)","v":0},0,{"$f":"6*3","v":18},196,3528]
[59012885,"Honor® Intrinsic® brand fungicide","1 x 36 lb",5112,5253.84,{"$f":"VLOOKUP($A8,'Step 2 - Order Planner'!$C$26:$H$40,4,FALSE)+VLOOKUP($A8,'Step 2 - Order Planner'!$C$26:$H$40,6,FALSE)","v":0},0,36,142,5112]
[59028038,"Insignia® SC Intrinsic® brand fungicide","4 x 30.5 fl oz",2303.36,2366.8000000000002,{"$f":"VLOOKUP($A9,'Step 2 - Order Planner'!$C$26:$H$40,4,FALSE)+VLOOKUP($A9,'Step 2 - Order Planner'!$C$26:$H$40,6,FALSE)","v":0},0,{"$f":"4*30.5","v":122},18.880000000000003,2303.36]
[59028040,"Insignia® SC Intrinsic® brand fungicide","2 x 2.5 gal",7522.5,7731.26,{"$f":"VLOOKUP($A10,'Step 2 - Order Planner'!$C$26:$H$40,4,FALSE)+VLOOKUP($A10,'Step 2 - Order Planner'!$C$26:$H$40,6,FALSE)","v":0},0,5,1504.5,7522.5]
[59027998,"Lexicon® Intrinsic® brand fungicide","4 x 21 oz",2520,2589.7199999999998,{"$f":"VLOOKUP($A11,'Step 2 - Order Planner'!$C$26:$H$40,4,FALSE)+VLOOKUP($A11,'Step 2 - Order Planner'!$C$26:$H$40,6,FALSE)","v":0},0,{"$f":"4*21","v":84},30,2520]
[59018087,"Maxtima® fungicide","4 x 26 oz",956.8,983.84,{"$f":"VLOOKUP($A12,'Step 2 - Order Planner'!$C$26:$H$40,4,FALSE)+VLOOKUP($A12,'Step 2 - Order Planner'!$C$26:$H$40,6,FALSE)","v":0},0,{"$f":"4*26","v":104},9.1999999999999993,956.8]
[59018071,"Maxtima® fungicide","2 x 2.5 gal",4715,4845.8599999999997,{"$f":"VLOOKUP($A13,'Step 2 - Order Planner'!$C$26:$H$40,4,FALSE)+VLOOKUP($A13,'Step 2 - Order Planner'!$C$26:$H$40,6,FALSE)","v":0},0,5,943,4715]
[59018094,"Navicon® Intrinsic® brand fungicide","4 x 37 fl oz",2308.8000000000002,2372.44,{"$f":"VLOOKUP($A14,'Step 2 - Order Planner'!$C$26:$H$40,4,FALSE)+VLOOKUP($A14,'Step 2 - Order Planner'!$C$26:$H$40,6,FALSE)","v":0},0,{"$f":"4*37","v":148},15.600000000000001,2308.8000000000002]
[59018095,"Navicon® Intrinsic® brand fungicide","2 x 2.5 gal",7320,7523.16,{"$f":"VLOOKUP($A15,'Step 2 - Order Planner'!$C$26:$H$40,4,FALSE)+VLOOKUP($A15,'Step 2 - Order Planner'!$C$26:$H$40,6,FALSE)","v":0},0,5,1464,7320]
[59013833,"Xzemplar® fungicide","2 x 114 oz",3602.4,3702.72,{"$f":"VLOOKUP($A16,'Step 2 - Order Planner'!$C$26:$H$40,4,FALSE)+VLOOKUP($A16,'Step 2 - Order Planner'!$C$26:$H$40,6,FALSE)","v":0},0,{"$f":"2*114","v":228},15.8,3602.4]
[59014120,"Xzemplar® fungicide","4 x 11.4 oz",861.84,885.56,{"$f":"VLOOKUP($A17,'Step 2 - Order Planner'!$C$26:$H$40,4,FALSE)+VLOOKUP($A17,'Step 2 - Order Planner'!$C$26:$H$40,6,FALSE)","v":0},0,{"$f":"4*11.4","v":45.6},18.899999999999999,861.84]
[null,null,null,{"$f":"SUM(D3:D17)","v":49364.4},{"$f":"SUM(E3:E17)","v":50734.539999999994},null,{"$f":"SUM(G3:G17)","v":0}]
["2026 Rest of Portfolio"]
["Article Number","Qaulifying Non-Agency Products","Package","Price","CA Redemption"]
{"$rows_left_out":35}
{"sheet":"Coverage Reference","index":6,"n_rows":43,"n_cols":18,"rows_kept":43,"cut":false,"hidden":true,"merged":[[1,0,1,1]]}
["Calculator Acreage"]
["Acre Coverage",null,null,null,4,5,6,7]
["Product Name","Article #","Package Size","Price/Case","Low Rate","Mid Rate","Mid2 Rate","High rate",null,null,"Low Rate","Mid Rate","High rate"]
["Aramax™ Intrinsic® Brand Fungicide",59026671,"2 x 2.5 gal",null,null,null,null,{"$f":"640/43.5","v":14.712643678160919},null,null,null,null,{"$f":"640/43.5","v":14.712643678160919}]
["Aramax™ Intrinsic® Brand Fungicide",59032979,"4 x 43.5 fl oz",null,null,null,null,{"$f":"174/43.5","v":4},null,null,null,null,{"$f":"174/43.5","v":4}]
["Emerald® Fungicide",59021463,"10 x .49 lb.",null,null,null,null,10,null,null,13.9,12,10,null,null,null,5,"gal"]
["Emerald® Fungicide",59012825,"50 x .49 lb.",null,null,null,null,50,null,null,69.3,60,50,null,null,null,640,"foz"]
["Encartis® fungicide",59014003,"2 x 2.5 gal",null,null,4.9000000000000004,4.2,3.7,null,null,99,99,99]
["Honor® Intrinsic™ brand Fungicide",59012885,"1 x 36 lb",null,null,null,null,12,null,null,24,18,12,null,null,null,{"$f":"4*43.5","v":174}]
["Honor® Intrinsic™ brand Fungicide",59012350,"6 x 3 lb",null,null,null,null,6,null,null,12,9,6]
["Insignia® SC Intrinsic™ brand Fungicide",59028040,"2 x 2.5 gal",null,null,null,null,21,null,null,36.799999999999997,28.9,21,null,null,null,{"$f":"Q7/Q9","v":3.6781609195402298}]
["Insignia® SC Intrinsic™ brand Fungicide",59028038,"4 x 30.5 oz",null,null,null,null,4,null,null,7,5.5,4]
["Lexicon® Intrinsic™ Brand Fungicide",59027998,"4 x 21 oz",null,null,null,null,4,null,null,5.68,4.84,4]
["Maxtima® Fungicide",59018087,"4 x26 oz",null,12,6,4,3,null,null,12,6,3]
["Maxtima Fungicide",59018071,"2 x 2.5 gal",null,73.5,36,24.6,18,null,null,73.5,36,18]
["Navicon® Intrinsic™ brand Fungicide",59018094,"4 x 37 fl oz",null,null,null,null,4,null,null,null,5,4]
["Navicon Intrinsic™ brand Fungicide",59018095,"2 x 2.5 gal",null,null,null,null,17,null,null,null,21,17]
["Pillar G Intrinsic™",59017959,"15 lbs",null,null,null,null,null,null,null,0.11,0.11,0.11]
["Pillar G Intrinsic™",59012784,"30 lbs ",null,null,null,null,null,null,null,0.22,0.22,0.22]
["Xzemplar™ Fungicide",59013833,"2 x 114 oz",null,null,32.799999999999997,25,20,null,null,32.799999999999997,24.95,20]
{"$rows_left_out":24}
{"sheet":"Sheet1","index":7,"n_rows":9,"n_cols":8,"rows_kept":9,"cut":false,"hidden":true,"merged":[[1,6,1,7],[1,1,1,4],[2,4,3,4],[6,7,8,7],[7,6,8,6],[2,1,3,1],[2,2,2,3],[2,6,3,6]]}
[]
[null,"Design Your Own Program (DYOP)",null,null,null,null,"Across the Course Solutions (ACS)"]
[null,"Qualifying Fungicide Purchase Level (DYOP)","Earned Incentive %",null,"DYOP Brand Requirements",null,"Qualifying EOP Purchase Level (Excluding DYOP Fungicides)","Earned Incentive %"]
[null,null,"Oct. 1-31, 2025","Nov. 1-Dec. 5, 2025",null,null,null,"Oct.1-Dec. 1, 2025"]
[null,"$3,000-$7,999 (Par)",0.08,0.03,"One (1) Qualifying Brand",null,"$3,000-$7,999",0.04]
[null,"$8,000-$19,999 (Birdie)",0.14000000000000001,0.06,"Three (3) Qualifying Brands",null,"$8,000-$19,999",0.06]
[null,"$20,000-$29,999 (Eagle)","17% (+12% on ACS brands)","9% (+12% on ACS brands)","Three (3) Qualifying Brands",null,"$20,000+",0.12]
[null,"$30,000-$39,999 (Albatross)","20% (+12% on ACS brands)","10% (+12% on ACS brands)","Three (3) Qualifying Brands",null,"(Eagle, Albatross, Ace DYOP customers  automatically qualify for this tier)"]
[null,"$40,000+ (Ace)","24% (+12% on ACS brands)","12% (+12% on ACS Brands)","Three (3) Qualifying Brands"]